{"text_format":"1","workbook":"xlsx","n_sheets":5,"sheets":["Materiales Cuadra","Computo","Presupuesto","Análisis de Precios","Materiales"],"not_rendered":{"charts":0,"images":1,"macros":0,"external_links":0,"defined_names":0,"comments":0,"pivot_tables":0},"unopened":[],"bounds":{"document_bytes":16777216,"sheet_cells":100000,"rows_first":2000,"rows_last":500,"rows_between":2000,"halvings":0,"cell_chars":16384,"cell_head_chars":4096},"cells_cut":0,"cells_raw":0,"read":"whole","date_system":"1900"}

{"sheet":"Materiales Cuadra","index":0,"n_rows":325,"n_cols":3,"rows_kept":325,"cut":false,"hidden":false,"merged":[]}
["Listado de Precios de Materiales"]
[]
["1-Elementos de Seguridad e Higiene y Herramnientas"]
["1.1 Seguridad e Higiene"]
["1.2 Herramientas"]
["2-Perforación estudio Suelo"]
["3-Ensayo de Hormigón"]
["4-Alquiler de equipos y de movimiento de tierra"]
["5-Aceros"]
["5.1 Hierros por barra de 12m"]
["       Barra torcionada x 4.2mm"]
["       Barra torcionada x 6mm"]
["       Barra torcionada x 8mm"]
["       Barra torcionada x 10mm"]
["       Barra torcionada x 12mm"]
["       Barra torcionada x 16mm"]
["       Barra torcionada x 20mm"]
["       Barra torcionada x 25mm"]
["       Barra lisa x 6mm"]
["       Barra lisa x 8mm"]
["       Barra lisa x 10mm"]
["       Barra lisa x 12mm"]
["       Barra lisa x 14mm"]
["       Barra lisa x 16mm"]
["5.2 Clavos y Alambres"]
["5.3 Tejidos para cercos 10m - un -"]
["5.4 Planchuelas preforadas x 6m"]
["5.5 Mallas electrosoldadas 6 x 2,15"]
["5.6 Caños estructurales cuadrados x 6 ml"]
["5.7 Caños estructurales rectangulares x 6 ml"]
["5.8 Caños estructurales redondos x 6 ml"]
["5.9 Planchuelas"]
["5.10 Hierros T Ángulos y Prefiles"]
["5.11 Zinguería y Chapas - ml -"]
["         Canaleta chapa galv. Nro 27 des. 0,33m"]
["         Canaleta chapa galv. Nro 27 des. 0,40m"]
["         Canaleta chapa galv. Nro 27 des. 0,50m"]
["         Canaleta chapa galv. Nro 24 des. 0,33m"]
["         Canaleta chapa galv. Nro 24 des. 0,40m"]
["         Canaleta chapa galv. Nro 24 des. 0,50m"]
{"$rows_left_out":286}
{"sheet":"Computo","index":1,"n_rows":45,"n_cols":9,"rows_kept":45,"cut":false,"hidden":false,"merged":[]}
[null,"Desig.","","L [m]","H [m]","","",""]
[null,1,0.18,12.5,5,{"$f":"D2*E2","v":62.5},{"$f":"4*4+2*0.8+1.2*1","v":18.8},{"$f":"F2-G2","v":43.7}]
[null,2,0.18,12.5,5,62.5,null,62.5]
[null,3,0.18,20,5,100,null,100]
[null,4,0.18,20,5,100,null,100]
[null,5,0.12,1.3,2.7,3.5100000000000002,{"$f":"0.6*0.4","v":0.24},3.2700000000000005]
[null,6,0.12,1.3,2.7,3.5100000000000002,{"$f":"0.8*2","v":1.6},1.9100000000000001]
[null,7,0.12,2.85,2.7,7.6950000000000012,1.6,6.0950000000000006]
[null,8,0.12,2.85,2.7,7.6950000000000012,null,7.6950000000000012]
[null,null,null,null,null,{"$f":"SUM(F2:F9)","v":347.40999999999997},22.240000000000002,325.17]
[]
["demoliciones"]
["Desig.","Dirección","","L [m]","H [m]","","",""]
["m1",null,null,null,null,{"$f":"D14*E14","v":0},null,{"$f":"F14-G14","v":0}]
["m2",null,null,null,null,0,null,0]
["m3",null,null,null,null,0,null,0]
["m4",null,null,null,null,0,null,0]
["m5",null,null,null,null,0,null,0]
["m6",null,null,null,null,0,null,0]
[null,null,null,null,null,{"$f":"SUM(F14:F19)","v":0},null,{"$f":"SUM(H14:H19)","v":0}]
[]
["Local","1","5","6","7"]
["uso","TINGLADO","KITCHENET","BAÑO","totales"]
["a",12.2,2.85,1.3]
["b",18,2.85,1.3]
["h",5,2.7,2.7]
["",0,0,2]
["",{"$f":"B26-B27","v":5},2.7,0.70000000000000018,{"$f":"SUM(B28:D28)","v":8.4}]
["A",{"$f":"+B30","v":219.6},8.1225000000000005,1.6900000000000002,229.41249999999999]
["A*",{"$f":"B24*B25","v":219.6},8.1225000000000005,1.6900000000000002,229.41249999999999]
["",{"$f":"+B32*B27","v":0},0,10.4,10.4]
["P",{"$f":"2*(B24+B25)","v":60.4},11.4,5.2,77]
["estructura de techo",{"$f":"B29","v":219.6},8.1225000000000005,1.6900000000000002,229.41249999999999]
["cubierta de techo",{"$f":"B29","v":219.6},8.1225000000000005,1.6900000000000002,229.41249999999999]
["cielorraso",{"$f":"B29","v":219.6},8.1225000000000005,1.6900000000000002,229.41249999999999]
["zingueria",{"$f":"+B32","v":60.4},null,0,60.4]
["revoques",{"$f":"+B32*B28*2","v":604},61.560000000000009,7.280000000000002,672.84]
["revestimientos",{"$f":"+B31*B32","v":0},{"$f":"C32*C27","v":0},10.4,10.4]
["carpeta",{"$f":"+B29","v":219.6},8.1225000000000005,1.6900000000000002,229.41249999999999]
["piso",{"$f":"+B29","v":219.6},8.1225000000000005,1.6900000000000002,229.41249999999999]
{"$rows_left_out":6}
{"sheet":"Presupuesto","index":2,"n_rows":41,"n_cols":10,"rows_kept":41,"cut":false,"hidden":false,"merged":[[23,3,24,3],[9,0,9,5],[19,3,19,4],[13,1,13,2],[21,3,21,4],[11,3,11,4],[13,3,13,4],[23,2,24,2],[21,0,21,2],[11,1,11,2],[23,0,24,0],[23,1,24,1],[2,0,2,3],[0,0,0,1],[0,2,0,5],[15,3,15,4],[17,0,17,5],[15,1,15,2]]}
[null,null,{"$f":"NOW()","v":"2023-03-29T09:41:45.630"}]
[]
["PLANILLA RESUMEN DE COMPUTO Y PRESUPUESTO - PRESUPUESTO DE MANO DE OBRA"]
[]
["OBRA:"]
["UBICACIÓN:"]
["COMITENTE:"]
["REFERENCIA:"]
[]
["Se tomó como referencia los precios publicados en la Revista Cuadros de Costos N 162 correspondiente al mes de diciembre de 2022."]
[]
[null,"MANO DE OBRA",null,{"$f":"SUM(E26:E41)","v":10355086.752600003}]
[]
[null,"MATERIALES",null,{"$f":"SUM(F26:F41)","v":10041721.708963675}]
[]
[null,"SUBTOTAL DIC-2022",null,{"$f":"SUM(E26:F41)","v":20396808.461563669}]
[]
[]
[]
[null,null,"SUBTOTAL MAR-2023",{"$f":"SUM(E30:F42)*1.2","v":23968237.886476409}]
[]
["Precio con IVA y Beneficios",null,null,{"$f":"1.7*D20","v":40746004.407009892}]
[]
["ITEM","DENOMINACION","CANTIDAD","UD.","ITEM","ITEM"]
[null,null,null,null,"MO","MAT"]
[1,"REPLANTEO Y PRELIMINARES",{"$f":"5.3*23.9","v":126.66999999999999},"m²",{"$f":"LOOKUP(A26,'Análisis de Precios'!B:B,'Análisis de Precios'!F:F)","v":45658.201499999996},{"$f":"LOOKUP(A26,'Análisis de Precios'!B:B,'Análisis de Precios'!G:G)","v":0}]
[2,"NIVELACION COMPACTACION Y RELLENO",100,"m²",{"$f":"LOOKUP(A27,'Análisis de Precios'!B:B,'Análisis de Precios'!F:F)","v":55980},{"$f":"LOOKUP(A27,'Análisis de Precios'!B:B,'Análisis de Precios'!G:G)","v":0}]
[3,"EXCAVACION PARA FUNDACIONES",{"$f":"1.5*1.5*1.5*14+23.9*2*0.1*0.3","v":48.683999999999997},"m³",{"$f":"LOOKUP(A28,'Análisis de Precios'!B:B,'Análisis de Precios'!F:F)","v":181688.68799999999},{"$f":"LOOKUP(A28,'Análisis de Precios'!B:B,'Análisis de Precios'!G:G)","v":0}]
[4,"DOBLADO DE ACEROS",2000,"Kg",{"$f":"LOOKUP(A29,'Análisis de Precios'!B:B,'Análisis de Precios'!F:F)","v":139950},{"$f":"LOOKUP(A29,'Análisis de Precios'!B:B,'Análisis de Precios'!G:G)","v":0},null,{"$f":"+PI()*(6/20)^2/10000","v":2.8274333882308141E-5},{"$f":"+H29*7850","v":0.2219535209761189},{"$f":"23.9*3*4/0.15","v":1911.9999999999998}]
[5,"FUNDACIONES DE HORMIGON ARMADO",{"$f":"1.5*1.5*0.5*14+0.4*0.4*1*14","v":17.990000000000002},"m³",{"$f":"LOOKUP(A30,'Análisis de Precios'!B:B,'Análisis de Precios'!F:F)","v":732372.90000000014},{"$f":"LOOKUP(A30,'Análisis de Precios'!B:B,'Análisis de Precios'!G:G)","v":272600.92453794146},null,{"$f":"+PI()*(8/20)^2/10000","v":5.0265482457436693E-5},{"$f":"+H30*7850","v":0.39458403729087804},{"$f":"23.9*3*4*4","v":1147.1999999999998}]
[6,"CAPA AISLADORA CAJÓN",{"$f":"+(23.9*2+5.3*2)*0.18","v":10.511999999999999},"m²",{"$f":"LOOKUP(A31,'Análisis de Precios'!B:B,'Análisis de Precios'!F:F)","v":35572.607999999993},{"$f":"LOOKUP(A31,'Análisis de Precios'!B:B,'Análisis de Precios'!G:G)","v":53530.562969256192},null,{"$f":"+PI()*(10/20)^2/10000","v":7.8539816339744827E-5},{"$f":"+H31*7850","v":0.61653755826699685}]
[7,"MAMP DE ELEVACION DE 18",{"$f":"+(23.9*2+5.3*2)*(3.1+2.1*3)","v":548.96},"m²",{"$f":"LOOKUP(A32,'Análisis de Precios'!B:B,'Análisis de Precios'!F:F)","v":1250105.4360000002},{"$f":"LOOKUP(A32,'Análisis de Precios'!B:B,'Análisis de Precios'!G:G)","v":1431783.8614214878},null,{"$f":"+PI()*(0.6)^2/10000","v":1.1309733552923256E-4},0.88781408390447558,{"$f":"3*3*5*4*2*1.5","v":540}]
[8,"REFUERZOS H°A° MAMPOSTERÍA",{"$f":"+C31*0.03","v":0.31535999999999997},"m³",{"$f":"LOOKUP(A33,'Análisis de Precios'!B:B,'Análisis de Precios'!F:F)","v":12838.3056},{"$f":"LOOKUP(A33,'Análisis de Precios'!B:B,'Análisis de Precios'!G:G)","v":8094.8244387678433},null,null,null,{"$f":"+SUMPRODUCT(I29:I32,J29:J32)","v":1356.4615449948512}]
[9,"CARPINTERIAS - SOLO COLOCACIÓN",15,"GL",{"$f":"LOOKUP(A34,'Análisis de Precios'!B:B,'Análisis de Precios'!F:F)","v":33075},{"$f":"LOOKUP(A34,'Análisis de Precios'!B:B,'Análisis de Precios'!G:G)","v":1431186.3879436071}]
[10,"CARPINTERIAS - PREPARACIÓN COLOCACIÓN",15,"m²",{"$f":"LOOKUP(A35,'Análisis de Precios'!B:B,'Análisis de Precios'!F:F)","v":40302.9},{"$f":"LOOKUP(A35,'Análisis de Precios'!B:B,'Análisis de Precios'!G:G)","v":6182.1322314049585}]
[11,"AZOTADO IMPERMEABLE interior",{"$f":"+C32","v":548.96},"m²",{"$f":"LOOKUP(A36,'Análisis de Precios'!B:B,'Análisis de Precios'!F:F)","v":838056.06},{"$f":"LOOKUP(A36,'Análisis de Precios'!B:B,'Análisis de Precios'!G:G)","v":1642668.9550611575}]
[12,"REVOQUE FRATASADO ",{"$f":"+C32*2","v":1097.92},"m²",{"$f":"LOOKUP(A37,'Análisis de Precios'!B:B,'Análisis de Precios'!F:F)","v":514007.71680000005},{"$f":"LOOKUP(A37,'Análisis de Precios'!B:B,'Análisis de Precios'!G:G)","v":1219507.834710744}]
[13,"PISO INDUSTRIAL H°A°",{"$f":"+C26","v":126.66999999999999},"m³",{"$f":"LOOKUP(A38,'Análisis de Precios'!B:B,'Análisis de Precios'!F:F)","v":5855004.0749999993},{"$f":"LOOKUP(A38,'Análisis de Precios'!B:B,'Análisis de Precios'!G:G)","v":3143939.9960078439}]
[14,"PÍNTURA AL LATEX ",{"$f":"+C37","v":1097.92},"m²",{"$f":"LOOKUP(A39,'Análisis de Precios'!B:B,'Análisis de Precios'!F:F)","v":268177.93920000002},{"$f":"LOOKUP(A39,'Análisis de Precios'!B:B,'Análisis de Precios'!G:G)","v":326797.24905785127}]
[15,"CUBIERTA SOBRE ESTRUCTURA METÁLICA",{"$f":"+C26","v":126.66999999999999},"m²",{"$f":"LOOKUP(A40,'Análisis de Precios'!B:B,'Análisis de Precios'!F:F)","v":327663.62249999994},{"$f":"LOOKUP(A40,'Análisis de Precios'!B:B,'Análisis de Precios'!G:G)","v":445756.25331088656}]
{"$rows_left_out":2}
{"sheet":"Análisis de Precios","index":3,"n_rows":235,"n_cols":8,"rows_kept":235,"cut":false,"hidden":false,"merged":[[0,2,0,3],[0,4,0,7],[5,2,5,7],[15,2,15,7],[14,2,14,7],[6,2,6,7],[7,2,7,7],[16,2,16,7],[187,2,187,7],[23,2,23,7],[67,2,67,7],[81,2,81,7],[95,2,95,7],[104,2,104,7],[117,2,117,7],[130,2,130,7],[143,2,143,7],[157,2,157,7],[169,2,169,7],[31,2,31,7],[53,2,53,7],[39,2,39,7]]}
[null,null,null,null,{"$f":"NOW()","v":"2023-03-29T09:41:45.630"}]
[]
[null,null,"ANALISIS UNITARIO POR RUBROS","Computo","Unidad","M. O","Materiales","P.U ($/un)"]
[]
[null,1,{"$f":"LOOKUP(B5,Presupuesto!A$26:A$40,Presupuesto!$B$26:$B$40)","v":"REPLANTEO Y PRELIMINARES"},{"$f":"LOOKUP(B5,Presupuesto!A:A,Presupuesto!C:C)","v":126.66999999999999},{"$f":"LOOKUP(B5,Presupuesto!A$26:A$40,Presupuesto!$D$26:$D$40)","v":"m²"},{"$f":"+SUMPRODUCT(G11:G12,E11:E12)","v":45658.201499999996},null,{"$f":"+SUMPRODUCT(G11:G12,F11:F12)","v":360.45}]
[]
[null,null,"Incluye armado de vallado perimetral para fijación de puntos de replanteo, marcado de ejes de mamposterias y filo exterior e interior sin incluir revoque, sobre piso de losa con hilo embebido en ferrite. incluye demolición de porciónes de muros existentes, recuperación de material para escombros y relleno para compactar."]
[]
[null,null,null,"un","Cantidad","Rendimiento","P.U"]
[null,null,"Mano de Obra"]
[101,null,{"$f":"LOOKUP(A11,Materiales!$C$10:$C$337,Materiales!$D$10:$D$348)","v":"Horas Oficial"},{"$f":"LOOKUP(A11,Materiales!$C$11:$C$337,Materiales!$E$11:$E$339)","v":"HS"},{"$f":"+F11*$D$5","v":25.334},0.2,{"$f":"LOOKUP(A11,Materiales!C:C,Materiales!G:G)","v":1102.5}]
[102,null,{"$f":"LOOKUP(A12,Materiales!$C$10:$C$337,Materiales!$D$10:$D$348)","v":"Horas Ayudante"},{"$f":"LOOKUP(A12,Materiales!$C$11:$C$337,Materiales!$E$11:$E$339)","v":"HS"},19.000499999999999,0.15,{"$f":"LOOKUP(A12,Materiales!C:C,Materiales!G:G)","v":933}]
[]
[null,2,{"$f":"LOOKUP($B$14,Presupuesto!A$26:A$40,Presupuesto!$B$26:$B$40)","v":"NIVELACION COMPACTACION Y RELLENO"},{"$f":"LOOKUP($B$14,Presupuesto!A$26:A$40,Presupuesto!$C$26:$C$40)","v":100},{"$f":"LOOKUP($B$14,Presupuesto!A$26:A$40,Presupuesto!$D$26:$D$40)","v":"m²"},{"$f":"+SUMPRODUCT(G20,E20)","v":55980},null,{"$f":"+SUMPRODUCT(G20,F20)","v":559.79999999999995}]
[]
[null,null,"Con pizón manual  en una a dos capas, incluye desmonte de las zonas elevadas, mexcla de suelo y escombros para refozar suelo. perfilado final con pala ,queda el terreno preparado para recibir al contrapiso. espesor promedio de trabajo :  5/10 cm. incluye el traslado y distribucion de suelo de relleno :  7 mts."]
[]
[null,null,null,"un","Cantidad","Rendimiento","P.U"]
[null,null,"Mano de Obra"]
[102,null,{"$f":"LOOKUP(A20,Materiales!$C$10:$C$337,Materiales!$D$10:$D$348)","v":"Horas Ayudante"},{"$f":"LOOKUP(A20,Materiales!$C$11:$C$337,Materiales!$E$11:$E$339)","v":"HS"},{"$f":"+F20*$D$14","v":60},0.6,{"$f":"LOOKUP(A20,Materiales!C:C,Materiales!G:G)","v":933}]
[]
[null,3,{"$f":"LOOKUP(B22,Presupuesto!A$26:A$40,Presupuesto!$B$26:$B$40)","v":"EXCAVACION PARA FUNDACIONES"},{"$f":"LOOKUP(B22,Presupuesto!A$26:A$40,Presupuesto!$C$26:$C$40)","v":48.683999999999997},{"$f":"LOOKUP(B22,Presupuesto!A$26:A$40,Presupuesto!$D$26:$D$40)","v":"m³"},{"$f":"+SUMPRODUCT(G28,E28)","v":181688.68799999999},null,{"$f":"+SUMPRODUCT(F28,G28)","v":3732}]
[]
[null,null,"Excavación a mano en tierra colorada para zanja de hasta 0,3mts de ancho, y hasta 0,2 mts de profundidad. el suelo extraido se aprovecha para posterior relleno y compactacion. suelo de fundacion compactado manualmente por impacto con pison de 15 kg desde altura 0,40 mts incluye remoción de escombros y pisos cortados con amoladora angular."]
[]
[null,null,null,"un","Cantidad","Rendimiento","P.U"]
[null,null,"Mano de Obra"]
[102,null,{"$f":"LOOKUP(A28,Materiales!$C$10:$C$337,Materiales!$D$10:$D$348)","v":"Horas Ayudante"},{"$f":"LOOKUP(A28,Materiales!$C$11:$C$337,Materiales!$E$11:$E$339)","v":"HS"},{"$f":"+F28*$D$22","v":194.73599999999999},4,{"$f":"LOOKUP(A28,Materiales!C:C,Materiales!G:G)","v":933}]
[]
[null,4,{"$f":"LOOKUP(B30,Presupuesto!A$26:A$40,Presupuesto!$B$26:$B$40)","v":"DOBLADO DE ACEROS"},{"$f":"LOOKUP(B30,Presupuesto!A$26:A$40,Presupuesto!$C$26:$C$40)","v":2000},{"$f":"LOOKUP(B30,Presupuesto!A$26:A$637,Presupuesto!$D$26:$D$639)","v":"Kg"},{"$f":"+SUMPRODUCT(G36,E36)","v":139950},null,{"$f":"+SUMPRODUCT(G36,F36)","v":69.974999999999994}]
[]
[null,null,"Corresponde a los doblados y cortes de barras para ejecución de armaduras de refuerzos verticales y horizontales en mamposterias y apoyos de estructura de techo, se ejecutan a mano con grinfas de diferentes tamaños, y en mesa de doblado convencional hecha con planchas de gruesas de madera."]
[]
[null,null,null,"un","Cantidad","Rendimiento","P.U"]
[null,null,"Mano de Obra"]
[102,null,{"$f":"LOOKUP(A36,Materiales!$C$10:$C$337,Materiales!$D$10:$D$348)","v":"Horas Ayudante"},{"$f":"LOOKUP(A36,Materiales!$C$11:$C$337,Materiales!$E$11:$E$339)","v":"HS"},{"$f":"+F36*$D$30","v":150},7.4999999999999997E-2,{"$f":"LOOKUP(A36,Materiales!C:C,Materiales!G:G)","v":933}]
[]
[null,5,{"$f":"LOOKUP(B38,Presupuesto!A$26:A$40,Presupuesto!$B$26:$B$40)","v":"FUNDACIONES DE HORMIGON ARMADO"},{"$f":"LOOKUP(B38,Presupuesto!A$26:A$40,Presupuesto!$C$26:$C$40)","v":17.990000000000002},{"$f":"LOOKUP(B38,Presupuesto!A$26:A$637,Presupuesto!$D$26:$D$639)","v":"m³"},{"$f":"+SUMPRODUCT(E49:E50,G49:G50)","v":732372.90000000014},{"$f":"+SUMPRODUCT(E44:E47,G44:G47)","v":272600.92453794146},{"$f":"+SUMPRODUCT(F44:F50,G44:G50)","v":66378.519909842231}]
[]
[]
{"$rows_left_out":196}
{"sheet":"Materiales","index":4,"n_rows":351,"n_cols":13,"rows_kept":351,"cut":false,"hidden":false,"merged":[[4,3,4,6],[6,3,7,6],[2,3,2,7],[0,3,0,6]]}
[null,null,null,"OBRA:\tSala Tableros\nUBICACIÓN:\tCampo Grande, Misiones\nCOMITENTE:\tCASA FUENTES - FINLAYS\nREFERENCIA:\tT28",null,null,null,{"$f":"NOW()","v":"2023-03-29T09:41:45.630"}]
[]
[null,null,null,"LISTADO DE MATERIALES NECESARIOS PARA EJECUCION DE LA OBRA"]
[]
[null,null,null,"TIEMPO ESTIMADO DE TRABAJO",null,null,null,{"$f":"+F11+F12+220","v":10374.3135}]
[]
[null,null,null,"PLAZO TOTAL DE OBRA ESTIMADO CUADRILLA: 2 Oficiales+2 Ayudantes",null,null,null,{"$f":"+(H5/8/I8)","v":324.19729687500001}]
[null,null,null,null,null,null,null,{"$f":"+H5/I8/8/20","v":16.209864843750001},4,"personas",null,"IVA",1.21]
[]
[null,null,null,"Elemento","un","CANTIDAD","COSTO UNITARIO","COSTO SUBTOTAL"]
[1,"MANO DE OBRA",101,"Horas Oficial","HS",{"$f":"SUMIF('Análisis de Precios'!A:A,C11,'Análisis de Precios'!E:E)","v":5205.6877999999997},{"$f":"1.5*735","v":1102.5},{"$f":"+G11*F11","v":5739270.7994999997}]
[null,null,102,"Horas Ayudante","HS",{"$f":"SUMIF('Análisis de Precios'!A:A,C12,'Análisis de Precios'!E:E)","v":4948.6257000000005},{"$f":"1.5*622","v":933},4617067.7781000007]
[null,null,103,"HORAS RETRO","HS",{"$f":"SUMIF('Análisis de Precios'!A:A,C13,'Análisis de Precios'!E:E)","v":0},null,0]
[null,null,104,"HORAS CAMIÓN","HS",{"$f":"SUMIF('Análisis de Precios'!A:A,C14,'Análisis de Precios'!E:E)","v":0},null,0]
[3,"VARIOS",301,"Cemento Portland","bls.",{"$f":"SUMIF('Análisis de Precios'!A:A,C15,'Análisis de Precios'!E:E)","v":1129.37736},{"$f":"1940/$M$8","v":1603.3057851239671},1810737.2548760332]
[null,null,302,"Cal hidratada","bls.",{"$f":"SUMIF('Análisis de Precios'!A:A,C16,'Análisis de Precios'!E:E)","v":702.66880000000003},{"$f":"1426.25/$M$8","v":1178.7190082644629},828249.07107438031]
[null,null,302.10000000000002,"Mortero preparado para revoque fino","bls.",{"$f":"SUMIF('Análisis de Precios'!A:A,C17,'Análisis de Precios'!E:E)","v":0},{"$f":"2456.8/$M$8","v":2030.413223140496},0]
[null,null,303,"Cemento de albañilería","bls.",{"$f":"SUMIF('Análisis de Precios'!A:A,C18,'Análisis de Precios'!E:E)","v":87.833600000000004},{"$f":"1940/$M$8","v":1603.3057851239671},140824.11900826448]
[null,null,304,"Arena mediana","m³",{"$f":"SUMIF('Análisis de Precios'!A:A,C19,'Análisis de Precios'!E:E)","v":564.01305760000014},{"$f":"4600/$M$8","v":3801.6528925619837},2144181.8718677694]
[null,null,305,"arena gruesa","m³",{"$f":"SUMIF('Análisis de Precios'!A:A,C20,'Análisis de Precios'!E:E)","v":0},null,0]
[null,null,306,"hormigón elaborado H 17","m³",{"$f":"SUMIF('Análisis de Precios'!A:A,C21,'Análisis de Precios'!E:E)","v":0},null,0]
[null,null,307,"hormigón elaborado H 4","m³",{"$f":"SUMIF('Análisis de Precios'!A:A,C22,'Análisis de Precios'!E:E)","v":0},null,0]
[null,null,307.10000000000002,"Vigueton premoldeado vipret clase V2 largo 4,2 mts","un.",{"$f":"SUMIF('Análisis de Precios'!A:A,C23,'Análisis de Precios'!E:E)","v":0},null,0]
[null,null,307.2,"Vigueta pretensada","m",{"$f":"SUMIF('Análisis de Precios'!A:A,C24,'Análisis de Precios'!E:E)","v":0},null,0]
[null,null,307.3,"ladrillo telgopor 12 42 100","un.",{"$f":"SUMIF('Análisis de Precios'!A:A,C25,'Análisis de Precios'!E:E)","v":0},null,0]
[null,null,308,"Piedra 6/20","m³",{"$f":"SUMIF('Análisis de Precios'!A:A,C26,'Análisis de Precios'!E:E)","v":95.683737600000001},{"$f":"5200/$M$8","v":4297.5206611570247},411202.83927272726]
[null,null,309,"piedra tipo balastron","m³",{"$f":"SUMIF('Análisis de Precios'!A:A,C27,'Análisis de Precios'!E:E)","v":0},null,0]
[null,null,309.10000000000002,"PIEDRA VOLADA COMÚN","Tn",{"$f":"SUMIF('Análisis de Precios'!A:A,C28,'Análisis de Precios'!E:E)","v":0},null,0]
[null,null,309.2,"PIEDRA VOLADA ELEGIDA PARA MURO","Tn",{"$f":"SUMIF('Análisis de Precios'!A:A,C29,'Análisis de Precios'!E:E)","v":0},null,0]
[null,null,310,"Hidrófugo","Kg.",{"$f":"SUMIF('Análisis de Precios'!A:A,C30,'Análisis de Precios'!E:E)","v":8.39208},{"$f":"36242/(200*$M$8)","v":149.7603305785124},1256.8006750413224]
[null,null,310.10000000000002,"Weber.tec con ceresita ","bsa.",{"$f":"SUMIF('Análisis de Precios'!A:A,C31,'Análisis de Precios'!E:E)","v":0},{"$f":"4985/$M$8","v":4119.8347107438021},0]
[null,null,311,"Alambre Go16","Kg.",{"$f":"SUMIF('Análisis de Precios'!A:A,C32,'Análisis de Precios'!E:E)","v":1.8500000000000003},{"$f":"1009.21/$M$8","v":834.0578512396695},1543.0070247933888]
[null,null,312,"alambre negro N° 16","Kg.",{"$f":"SUMIF('Análisis de Precios'!A:A,C33,'Análisis de Precios'!E:E)","v":0},null,0]
[null,null,313,"alambre negro nº 9","Kg.",{"$f":"SUMIF('Análisis de Precios'!A:A,C34,'Análisis de Precios'!E:E)","v":0},null,0]
[null,null,314,"alambre de púa x 500 mts.","rollo",{"$f":"SUMIF('Análisis de Precios'!A:A,C35,'Análisis de Precios'!E:E)","v":0},null,0]
[null,null,315,"hierro Ø 4,2 torsionado","brs.",{"$f":"SUMIF('Análisis de Precios'!A:A,C36,'Análisis de Precios'!E:E)","v":0},null,0]
[null,null,316,"Hierro Ø 6 torsionado","brs.",{"$f":"SUMIF('Análisis de Precios'!A:A,C37,'Análisis de Precios'!E:E)","v":14.099000000000002},{"$f":"1139.68/$M$8","v":941.88429752066122},13279.626710743805]
[null,null,317,"hierro  Ø 8 torsionado","brs.",{"$f":"SUMIF('Análisis de Precios'!A:A,C38,'Análisis de Precios'!E:E)","v":0},null,0]
[null,null,318,"hierro  Ø 10 torsionado","brs.",{"$f":"SUMIF('Análisis de Precios'!A:A,C39,'Análisis de Precios'!E:E)","v":0},null,0]
[null,null,318.10000000000002,"Hierro  Ø 12 torsionado","brs.",{"$f":"SUMIF('Análisis de Precios'!A:A,C40,'Análisis de Precios'!E:E)","v":2.5000000000000001E-2},{"$f":"4175.85/$M$8","v":3451.1157024793392},86.277892561983492]
{"$rows_left_out":311}